Error

  • Github fatal: The remote end hung up unexpectedly

    Github fatal: The remote end hung up unexpectedly 2015-05-06

    昨晚为 dp2 系统第一次上传代码到 github 的时候,用 VS2013 的发布功能屡屡报错,用 Github 的 Git for Windows 的图形界面发布也报错,然后不得已用它的命令行 push,没能成功,很多次是提示:fatal: The remote end hung up unexpectedly. 在 StackOverflow 中搜到这样一篇文字: http://stackoverflow.com/questions/15240815/git-fatal-the-remot

    关键词: Error, Git, github
  • 文件上传Error setting expression 'upload' with value '[Ljava.lang.String

    文件上传Error setting expression 'upload' with value '[Ljava.lang.String 2015-03-31

    ognl.MethodFailedException: Method "setUploadImage" failed for object cn.itcast.upload.UploadAction@46db2f36 [java.lang.NoSuchMethodException: cn.itcast.upload.UploadAction.setUploadImage([Ljava.lang.String;)] at ognl.OgnlRuntime.callAppropriate

    关键词: struts, Error, 文件上传错误
  • fatal: unable to access *:Empty reply from server

    fatal: unable to access *:Empty reply from server 2015-03-31

    亲测近日 GFW 或者其他组织又开始阻止墙内人员接触github了(据说是什么度的网页内嵌代码被密谋篡改导致了对hub的DDOS打击,目测战况惨烈),直接导致 fatal: unable to access 'https://github.com/*/*.git/': Empty reply from server 大概的解决办法是修改HTTPS链接为SSH访问,step如下: $ git remote set-url origin git@github.com:USERNAME/OTHERRE

    关键词: deploy, Error, ACCESS, push, github, hexo
  • NodeJs在linux下监听端口时抛错Error: listen EACCES

    NodeJs在linux下监听端口时抛错Error: listen EACCES 2015-03-21

    june@june-Satellite-C600:~/nodejs/lesson$ node random.js Random Number Generator Running- events.js:72 throw er; // Unhandled 'error' event ^ Error: listen EACCES at errnoException (net.js:904:11) at Server._listen2 (net.js:1023:19) at listen (net.js

    关键词: eacces, Error, nodejs, Listen
  • Eclipse Error - Error notifying a preference...

    Eclipse Error - Error notifying a preference... 2015-03-05

    用 Eclipse 时经常出现错误提示: Error notifying a preference change listener. Check the log for details. Widget is disposed 最简单解决方法: 关闭 Breadcrumb bar,在需要的时候重新打开.根本原因没有详查,不清楚 Eclipse Version: Version: Indigo Service Release 2 Build id: 20120216-1857

    关键词: eclipse, Error, notifying
  • linux 安装 mongodb 时的"dbpath (/data/db/) does not "

    linux 安装 mongodb 时的"dbpath (/data/db/) does not " 2015-01-30

    前面安装来说都是很顺利的,但是在启动的时候遇到了这么一个问题 ERROR: dbpath (/data/db/) does not exist. Create this directory or give existing directory in --dbpath. See http://dochub.mongodb.org/core/startingandstoppingmongo 从这个问题来看 ,应该是没有创建 /data/db 目录,那么就用 "sudo mkdir -p /data/

    关键词: linux, Error, exist, mongdb
  • CentOS 安装/升级Git 1.9.4

    CentOS 安装/升级Git 1.9.4 2014-12-30

    因为yum源的最新版本是1.7.x,所以无法通过yum进行更新,下面描述如何通过编译源码进行安装 1.安装需要的依赖 第一步我们需要做的就是确认系统已经安装了编译git时需要的依赖.使用下面的安装命令即可(已经安装过的不会重新再安装) yum install curl yum install curl-devel yum install zlib-devel yum install openssl-devel yum install perl yum install cpio yum insta

    关键词: centos, 安装, Error, url, Git, 升级, The, requested, returned
  • Rust runtime error: Illegal instruction: 4

    Rust runtime error: Illegal instruction: 4 2014-12-25

    use std::intrinsics; #[deriving(Show)] struct NewType<'a, T: 'a> { a:int, b:String, v: &'a T } fn main() { let t: NewType<int> = unsafe{ intrinsics::init()}; println!("{}", t); // Error at this line } $ rustc mem.rs $ ./mem Illeg

    关键词: rust, Error
  • 找不到类class org.apache.sqoop.Sqoop

    找不到类class org.apache.sqoop.Sqoop 2014-09-30

    前言: 最近由于要使用Sqoop来到出数据到hdfs,可是发现Sqoop1.4.5跟hadoop2.X不兼容,需要对Sqoop1.4.5进行编译,编译的具体方法见:http://my.codeweblog.com/AlbertHa/blog/318551 如果一切都顺利的话需要就不会遇到什么问题,但是有一个问题一直困扰了一周! 这是问题是什么呢? 就是每次执行$SQOOP_HOME/bin/sqoop脚本的时候总是抱一个错误: Error: Could not find or load main

    关键词: Error, load, main, class, not, find, could, sqoop1.4.4, hadoop2.4.0
  • windows7 64位 node.js npm命令失效-Error ENOENT stat

    windows7 64位 node.js npm命令失效-Error ENOENT stat 2014-09-24

    windows7 64位 系统 从node.js官网安装最新版的node.js 64 之后node命令不行 解决:手动将环境变量PATH中的node.js目录放到最前面 然后npm命令失效,错误如:Error: ENOENT, stat 'C:\Users\xxoo\AppData\Roaming\npm' 不知所以然,谷百后解决: 在C:\Users\xxoo\AppData\Roaming\下手动新建无后缀的 npm 文件 求解?

    关键词: stat, windows7, npm, enoent, NODE.js, Error, 64位
  • jfinal-web jfinal下的基础model实现以及数据压缩和缓存及websocket

    jfinal-web jfinal下的基础model实现以及数据压缩和缓存及websocket 2014-09-12

    https://github.com/Dreampie/jfinal-web jfinal-web是一款jfinal下的web插件: <dependency> <groupId>cn.dreampie</groupId> <artifactId>jfinal-web</artifactId> <version>${jfinal-web.version}</version> </dependency> 目前刚刚发

    关键词: json, gzip, Java, Web, Error, Cache, JFinal
  • Django启动报错 Error: [Errno 10013]

    Django启动报错 Error: [Errno 10013] 2014-09-08

    Django启动报错 Error: [Errno 10013] PS D:\_python\project_web1> python .\manage.py runserver Performing system checks... System check identified no issues (0 silenced). You have unapplied migrations; your app may not work properly until they are applied.

    关键词: Error, errno, 10013, Django启动报错
  • openstack 命令行nova list执行失败,提示认证不成功

    openstack 命令行nova list执行失败,提示认证不成功 2014-09-03

    [问题现象] 2014-09-03 19:18:25.520 22053 WARNING keystoneclient.middleware.auth_token [-] Verify error: Command 'openssl' returned non-zero exit status 4 2014-09-03 19:18:25.522 22053 WARNING keystoneclient.middleware.auth_token [-] Authorization failed

    关键词: openssl, Error, status, command, exit, returned, verify, non-zero
  • play2 routes文件#注释中不能含有中文

    play2 routes文件#注释中不能含有中文 2014-08-19

    今天新建一个play2.3.3的工程 心血高啊,在routes文件中给不同Controller加上了中文注释,结果就报如下错误: [error] IO error while decoding D:\devproj\play\mango23\target\scala-2.11\src_managed\main\routes_reverseRouting.scala with UTF-8 [error] Please try specifying another one using the -en

    关键词: compilation, try, Error, failed, Decoding, while, play2, specifying, another
  • PING主机名称不通的解决

    PING主机名称不通的解决 2014-08-08

    通过端口9999连接到数据库之后,pgpool启动监听. test_pgpool=# select count(1) from final_back_pl_lv10; ERROR: could not establish connection DETAIL: could not translate host name "db-12" to address: Temporary failure in name resolution 2.原因是db-12这个计算机名称(本机)无法被解析,这

    关键词: failure, Error, name, connection, not, could, establish, Temporary, resolution
  • redis报protocol error的真正原凶

    redis报protocol error的真正原凶 2014-07-31

    前段时间写了个文章详细描述了在什么场景下会出现redis的protocol error错误,但是手抽筋, 不小心点错给删了,而且还原不了,没办法了,只能重写一下,但是没上次那么详细了,如果不太明白就看源代码吧!首先呢,这种错误是基于使用了phpredis的的长连接和multi功能才会出现!这里有两个问题 1.当你开了事务,做了N次写操作,然后又discard之后又做了M次操作(M小于N),这样请求就会被阻塞住(这个操作无论使用短连接还是长连接,都能复现),具体看代码: $redis = new

    关键词: redis, Error, phpredis, prorocol
  • 记录C++ Builder 6.0开发过程中的一个linker error

    记录C++ Builder 6.0开发过程中的一个linker error 2014-07-27

    今天在开发的时候,本来好好的工程,突然报出这样的错误: [Linker Error] Unresolved external '__fastcall TMainForm::OnPort1Message(Messages::TMessage&)' referenced from D:\NEW\A\SHANXIJUNQUA_DEMO\MAIN.OBJ 因为之前开发相关的程序的时候一直用的是微软的那一套的工具,这个也是最近才入手,所以不是很熟悉.于是就求助网络,最后在[[Linker Error] U

    关键词: linker, Error, Builder
  • jquery ajax 在设置dataType:"json"后,无法执行success回调函数的问题

    jquery ajax 在设置dataType:"json"后,无法执行success回调函数的问题 2014-06-27

    今日用ajax请求后台的json数据是,浏览显示请求成功,但是ajax里的success回调函数死活不执行.上网查了好久,终于知道了原因:jquery1.4版本以后对json格式要求非常严格了,必须是标准的json结构(参见json.org)的数据才算是成功返回,否则都会出错,无法解析返回的json数据.

    关键词: ajax, json, Error
  • While reading *** Default.png pngcrush caught l

    While reading *** Default.png pngcrush caught l 2014-06-12

    打包上传的时候遇到了 :"While reading *** Default.png pngcrush caught libpng error" 然后就是什么 While checking alphas in *** Default.png pngcrush caught libpng error: Not enough image dCommand /Applications/Xcode.app/Contents/Developer/Platforms/iPhoneOS.platfo

    关键词: libpng, Error, while, reading, Default.png, pngcrush, caught
  • HTML Parsing Error KB927917

    HTML Parsing Error KB927917 2014-06-10

    它的发生,是因为某些DOM操作发生在DOM树加载完成之前,比如appendChild 就像下面的代码: <html> <head> </head> <body> <div> <script type="text/javascript"> alert(document.readyState); var oDiv = document.createElement("DIV"); oDiv.inner

    关键词: parsing, Error, html, KB927917
  • Go的error返回值相关的坑

    Go的error返回值相关的坑 2014-06-09

    http://play.golang.org/p/GSn5_I2Qqs package main import "log" type MyError struct{} func (err *MyError) Error() string { return "MyError" } func Foo() (err *MyError) { return } func main() { var err error if err = Foo(); err != nil { l

    关键词: Error, GO语言, Golang
  • Zend Server安装后首次运行就出现Internal Server Error的解决

    Zend Server安装后首次运行就出现Internal Server Error的解决 2014-05-25

    刚才安装了Zend Server,安装后首次运行就爆出了一个Internal Server Error,于是看了看日志 \Apache2\logs\error.log 中有这么一行记录: [Sun May 25 22:57:04 2014] [error] Zend Enabler cannot load because of a problem in its configuration file: XML parse error on line 1 column 1 - invalid byt

    关键词: Error, Server, Internal, ZendServer
  • 安装ubuntu/win7后选择win7出现 a read disk error occurred

    安装ubuntu/win7后选择win7出现 a read disk error occurred 2014-03-16

    (本人百度ID:_铭_轩_)安装ubuntu/win7双系统后重启电脑ubuntu正常进入但选择win7 loader会提示:a read disk error的错误信息,无法进入win7系统,之前自己折腾双系统时也遇到过这情况,记得使用ultraiso做的U盘启动安装的ubuntu,网上也没有太多这问题的解决方法,最后偶然在ubuntu社区看到个方法,感觉应该适用于这个问题,试了一下~Ok了~这里贴出来分享给大家(在百度知道上我也贴了的说,当时自己解决没多久就发现也有人遇到这问题了),let'

    关键词: ubuntu, Error, Read, Disk, occurred, win7双系统
  • uwsgi 提示Fatal error in heap setupAllocation failed

    uwsgi 提示Fatal error in heap setupAllocation failed 2014-03-07

    # Fatal error in heap setup # Allocation failed - process out of memory Fri Mar 7 21:41:46 2014 - DAMN ! worker 1 (pid: 22639) died, killed by signal 5 :( trying respawn ... Fri Mar 7 21:41:46 2014 - Respawned uWSGI worker 1 (new pid: 22641) 解决方法: 把-

    关键词: django, heap, Error, fatal, uwsgi
  • HighCharts 制作图表导出图片(SVG转JPEG格式)遇到的两个问题

    HighCharts 制作图表导出图片(SVG转JPEG格式)遇到的两个问题 2014-03-05

    问题一: /usr/bin/java -jar /data/batik/batik-rasterizer.jar -m image/jpeg -d /data/web/uploadfiles/temp/c5518355c41c05ebd31e0c011d139109.jpg /data/web/uploadfiles/temp/c5518355c41c05ebd31e0c011d139109.svg About to transcode 1 SVG file(s) Converting c551

    关键词: Error, JPEG, not, The, has, highcharts, Specified, quality, been, SVG转JPEG格式;
  • JSLint Error 之 Don't make functions within a loop

    JSLint Error 之 Don't make functions within a loop 2014-02-11

    最近写JavaScript的时候经常遇到Don't make functions within a loop这个错误,其实没啥大碍,即使报错也不太影响代码的执行,不过在下看着就是觉得不爽,非常的不爽, 主要遇到这个问题的地方是在for循环多个onclick事件的时候 for (i = 0; i < length; i++) { (function (i) { pics[i].onclick = function() { alert(i); }; }(i)); } 事实上上面的代码其实已经解决了D

    关键词: jslint, JavaScript, Error
  • golang: 详解interface和nil

    golang: 详解interface和nil 2014-01-19

    golang的nil在概念上和其它语言的null.None.nil.NULL一样,都指代零值或空值.nil是预先说明的标识符,也即通常意义上的关键字.在golang中,nil只能赋值给指针.channel.func.interface.map或slice类型的变量.如果未遵循这个规则,则会引发panic.对此官方有明确的说明:http://pkg.golang.org/pkg/builtin/#Type golang中的interface类似于java的interface.PHP的interfa

    关键词: interface, gdb, Error, Golang, nil
  • error:Error running 'env GEM_PATH=/Users/*

    error:Error running 'env GEM_PATH=/Users/* 2014-01-02

    when run: $ rvm install ruby-*.*.*-p* Error running 'env GEM_PATH=/Users/***/.rvm/gems/ruby-*.*.*-p*:*********, please read /Users/***/.rvm/log/ruby-*.*.*-p*/rubygems.install.log Installation of rubygems did not complete successfully. solve: $ rvm re

    关键词: ruby, rvm, Error, Install
  • error: failed to push some refs to git

    error: failed to push some refs to git 2013-12-13

    error message: ~/my_project/ $ git push warning: push.default is unset; its implicit value is changing in Git 2.0 from 'matching' to 'simple'. To squelch this message and maintain the current behavior after the default changes, use: git config --glob

    关键词: Error, Git, push
  • MySQL创建函数,报错:SQL Error (1418)

    MySQL创建函数,报错:SQL Error (1418) 2013-12-07

    MySQL函数不能创建,是未开启创建功能: mysql> show variables like '%func%'; +---------------------------------+-------+ | Variable_name | Value | +---------------------------------+-------+ | log_bin_trust_function_creators | OFF | +---------------------------------+

    关键词: sql, MySQL, Error, 函数, 1418
  • MySQL创建一个简单的存储过程,报错:SQL Error (1064)

    MySQL创建一个简单的存储过程,报错:SQL Error (1064) 2013-12-07

    源代码: CREATE PROCEDURE AvgFruitPrice4() BEGIN SELECT AVG(f_price) AS avgprice FROM fruits; END; 解决方法1: delimiter $$ CREATE PROCEDURE AvgFruitPrice4() BEGIN SELECT AVG(f_price) AS avgprice FROM fruits; END $$ 解决方法2: CREATE PROCEDURE AvgFruitPrice4() SE

    关键词: sql, 存储过程, MySQL, Error, 1064
  • Code Sign error: No matching provisioning profile found: Your build settings specify a provisioni...

    Code Sign error: No matching provisioning profile found: Your build settings specify a provisioni... 2013-11-28

    今天别人让我帮忙调代码,发来工程,运行的时候一直出现如下这个JB错误: 点击"Fix Issue"还是TM不行!!MLGBD,老是提示指定UUID的provisioning profile找不到,感觉很怪异.我明明重新注册UDID,重新生成provisioning profile,并且重新安装,TMD为毛还不行:百度好多都不给力,只好谷歌:还真通过谷歌找到了答案,虽然是英文的,但是勉强着有道着还是大概知道了原因所在!!参考地址:http://stackoverflow.com/ques

    关键词: Error, Build, code, found, profile, Your, sign, provisioning, matching
  • heroku error when change app name

    heroku error when change app name 2013-11-22

    当输入 $ git push heroku master 显示提示信息 ! Your account email@email.com does not have access to peaceful-dawn-5871. ! ! SSH Key Fingerprint: *:*:*:*:*:*:*:*:*:*:*:*:* fatal: Could not read from remote repository. Please make sure you have the correct acce

    关键词: Error, Git, Rails, heroku
  • apt-get update时,"http //ppa.launchpad.net precise release the following signatures were invalid"

    apt-get update时,"http //ppa.launchpad.net precise release the following signatures were invalid" 2013-11-16

    I found that just doing `sudo rm -rf /var/lib/apt/lists && sudo mkdir /var/lib/apt/lists` worked for me. 此回答的原文链接: https://answers.launchpad.net/ubuntu/+source/update-manager/+question/194077

    关键词: Error, update, apt-get, precise
  • Heroku error:App not found

    Heroku error:App not found 2013-11-10

    输入 $ heroku open $ heroku stack $ heroku config 显示 App not found 你需要在git上移除heroku的远程 用 : $ git remote rm heroku 然后你需要添加一个新的远程: $ git remote add heroku git@heroku.com:your-app.git 接下来你可以运行你的heroku命令了.

    关键词: Error, Git, Rails, heroku
  • Heroku error:Permission denied (publickey)

    Heroku error:Permission denied (publickey) 2013-11-10

    $ git push heroku master 显示如下提示: Permission denied (publickey). fatal: Could not read from remote repository. Please make sure you have the correct access rights and the repository exists. 你需要将公钥同步到Heroku上: $ heroku keys:add ~/.ssh/*.pub 如果没有,那么herok

    关键词: Error, Rails, Key, heroku
  • postgres fatal error in rails

    postgres fatal error in rails 2013-11-10

    FATAL: role * does not exist You've made this question a lot harder to answer by omitting details like the OS and version you're on, how you installed PostgreSQL, etc. You mentioned Ubuntu so I'm going to guess you installed the PostgreSQL packages f

    关键词: postgres, Error, fatal, Rails
  • 关于ffmpeg的error返回值

    关于ffmpeg的error返回值 2013-11-09

    在我的实际项目中, 用 av_read_frame获取音视频帧数据. 现在有个功能需要我根据 av_read_frame的返回值判断文件或者流是否结束. 之前对av_read_frame的返回值只做了简单的判断. 今天查看源码,发现其返回的状态信息还是比较有用的 ,写此文记录一下吧. av_read_frame简介:ffmpeg中的av_read_frame()的作用是读取码流中的音频若干帧或者视频一帧.例如,解码视频的时候,每解码一个视频帧,需要先调用 av_read_frame()获得一帧视

    关键词: ffmpeg, Error, return
  • support default-int

    support default-int 2013-11-06

    在VS2008中生成时出错:error C4430: missing type specifier - int assumed. Note: C++ does not support default-int 这是因为在VC6中,如果没有显示的指定返回值类型,编译器将其视为默认整型.但是vs2008不支持默认整型. 解决方法如下: 打开:项目----项目属性----配置属性----C/C++----命令行,在附加选项那里添加/wd4430这个选项.

    关键词: specifier, Error, type, support, missing, default-int, C4430
  • PL/SQL远程连接数据库异常处理

    PL/SQL远程连接数据库异常处理 2013-09-29

    1· 无法解析指定的连接标识符异常: 解决办法:配置TNS_ADMIN环境变量,变量值为tnsnames.ora路径 2·I/O error 123 解决办法:配置OCI library 具体方法为: 从oracle服务器处拷贝一个oci.dll文件到本地的tnsnames.ora路劲下 tools->preferences->connection Oracle Home=tnsnames.ora路径 OCI library=tnsnames.ora路径\oci.dll

    关键词: pl sql, Error, I/O, 123
  • Django 运行 runserver 端口占用,报错:Errno 10013

    Django 运行 runserver 端口占用,报错:Errno 10013 2013-09-23

    来源:http://catroll.com/python-django-error-10013.html 运行 django runserver 的时候,出现 Error 10013,即 8000 端口被占用. 使用 apache wsgi 也是说端口占用. 不想换端口,有一段快捷方式在浏览器上呢,所以需要找出那个占用端口的进程,然后卸掉. 1.查看所有的端口占用情况 C:\Users\Administrator\>netstat -ano 活动连接 协议 本地地址 外部地址 状态 PID TC

    关键词: python, django, Error, 10013
  • struts2 表单参数带有"."异常 解决方法

    struts2 表单参数带有"."异常 解决方法 2013-09-18

    一直很少把日志级别调到info,除非调试需要,今天突然发现struts2抛如下异常,原因到是很简单,主要是表单提交的name中含有特殊字符".",struts2会自动去匹配用"."分隔的对象,问题是我做的平台中很多自定义动态查询条件都含有".",我不可能因为这个去重写框架逻辑 2013-09-17 11:49:18,824 [com.opensymphony.xwork2.ognl.OgnlValueStack]-[WARN] Error set

    关键词: expression, target, setproperty, Error, null, for, struts2, setting, ognl.OgnlException:
  • 访问Nginx发生SSL connection error的一种情况

    访问Nginx发生SSL connection error的一种情况 2013-09-16

    假如Nginx有两个server配置如下: server { listen 80; listen 443; server_name a.xxx.com; ssl on; ssl_certificate /path/server.crt; ssl_certificate_key /path/server.key; ... } server { listen 80; listen 443; server_name b.xxx.com; #以下没有ssl相关的配置 ... } 访问 https://a

    关键词: nginx, SSL, Error
  • On Window 7 to install DB2 error summarize

    On Window 7 to install DB2 error summarize 2013-08-27

    1 DB2JAVIT:RC=9505 Reason: The reason for this error is because the user who start the DB2 does not have the privilege to access the files in the installation directory duo to the system security feature. Solution: Add the user id to the db2admins or

    关键词: db2, Error, Install, solution
  • 解决Ubuntu下dpkg的available问题

    解决Ubuntu下dpkg的available问题 2013-08-16

    最近入手一个pcDuino,闲来没事,想先熟悉一下linux环境,搭一下各种东东,然后进行传感器扩展玩玩开源硬件,无奈,突然间遇到这么一个问题 sub-process/usr/bin/dpkg returned an error code(2) 然后各种百度与Google均不得解,搔首弄耳,终于从dpkg的available上弄出了文章,根据shell的提示,找到/var/lib/dpkg/available 并cat之,发现看不懂啊,没办法了,从这里入手,找到这么一个信息: sudo dpkg

    关键词: dpkg, Error, returned, sub-process/usr/bin/dpkg, code(2), /var/lib/dpkg/available
  • kernel: *BAD*gran_size: xx chunk_size: xx num_r...

    kernel: *BAD*gran_size: xx chunk_size: xx num_r... 2013-08-07

    将 3.9.5 的Kernel应用在线上服务器,昨日遇到"*BAD*gran_size"的错误信息. 日志显示 2.6.32-358.6.3.el6.x86_64 未出现此问题,升级到 3.9.5-1.el6.x86_64 时开始抛出异常. 日志中可看出是"mtrr_cleanup: can not find optimal value"时给出的错误信息,MTRR(Memory Type Range Register)似乎是对X窗口系统的优化.随后在grub启动参数

    关键词: linux, kernel, mtrr, Error, higkoo
  • [解决]An internal error occurred during: "Launchi...

    [解决]An internal error occurred during: "Launchi... 2013-08-06

    [已解决]ADT中运行Android程序出错:An internal error occurred during: "Launching New_configuration". Path for project must have only one segment. 2012 年 12 月 20 日 下午 11:31 crifan 已有602人围观 我来说几句 [问题] 在折腾: [记录]Android中利用HttpClient实现POST请求 的过程中,写好代码了,点击运行,结果出错

    关键词: project, Error, for, Internal, must, occurred, during:, "Launching, New_configuration".Path
  • Error: Protected multilib versions: libgcc-4.4....

    Error: Protected multilib versions: libgcc-4.4.... 2013-07-28

    在使用yum安装包libgcc.i686时遇到如图这种问题 解决方法: 先装libgcc.x86_64使它update到最新版本,再装libgcc.i686就能装上了:)

    关键词: Error, protected, multilib, versions
  • 关于gcc: error trying to exec 'cc1': execvp:

    关于gcc: error trying to exec 'cc1': execvp: 2013-07-23

    关于gcc: error trying to exec 'cc1': execvp: 没有该文件或目录的错误 今天在编译X11的时候出现了这个问题 网上说的也是云里雾里的 后来发现原来是自己修改了PATH路径 把它改成远了的路径就可以了. 输入:whereis gcc 就可以了发现在/usr/bin/gcc存在一个gcc 所以我就把PATH路径设过去,就OK了 export PATH=/usr/bin:$PATH(根据你自己的位置进行重设)

    关键词: linux, gcc, Error, Make, menuconfig
  • 413 Request Entity Too Large 错误处理

    413 Request Entity Too Large 错误处理 2013-07-02

    今天发现Mybb 论坛上传附件时出现这个错误: 413 Request Entity Too Large 在控制台修改限制没有用.这个限制是nginx 的配置导致的. 解决方法 : http { ## # Basic Settings ## client_max_body_size 8m; #加入这一句 检查有没有错误 : $ sudo nginx -t -c nginx.conf 平滑重启: $ sudo nginx -s reload

    关键词: nginx, Error, 413

iOS 开发

Android 开发

Python 开发

JAVA 开发

开发语言

PHP 开发

Ruby 开发

搜索

前端开发

数据库

开发工具

开放平台

Javascript 开发

.NET 开发

云计算

服务器

Copyright (C) codeweblog.com, All Rights Reserved.

CodeWeblog.com 版权所有 闽ICP备15018612号

processed in 0.055 (s). 11 q(s)