wamp fatal error allowed memory cacti

sponsored links

WordPress appears Fatal error: Allowed memory size of 33554432 bytes exhausted the wrong solution

WordPress appears Fatal error: Allowed memory size of 33554432 bytes exhausted the wrong solution Many of my friends, when suddenly the upgrade WordPress2.8 have found this error: Fatal error: Allowed memory size of 33554432 bytes exhausted. Main rea ...

Fatal error: Allowed memory size of 8388608 bytes exhausted problem solving

Problem: Fatal error: Allowed memory size of 8388608 bytes exhausted (tried to allocate 3214636 bytes) in E: \ VertrigoServ \ www \ install.php on line 488 Solution 1: (I use this way can be installed) Open the. Htaccess file beginning with the top p

Fatal error: Allowed memory size of 134217728 bytes exhausted

/ Etc / php / php.ini memory_limit = 256M

PHP Allowed memory size of the memory overflow solution

Tracking this issue before, but that's not a good time tools, not to see such a small, relatively thin in this engaging, even before the revised view. So to sum up writing a small article. PHP occasionally burst about the following error Allowed

Deal a fatal PHP error (Fatal Error or E_ERROR)

How to deal with PHP's E_ERROR or Fatal Error is a hassle. When the program because of insufficient memory, etc. The implementation of time-out interrupt when a fatal error accidents, and related processing needs, and then try ... catch error_rep

Start eclipse report A fatal error has been detected by the Java Runtime Environment:

# # A fatal error has been detected by the Java Runtime Environment: # # EXCEPTION_ACCESS_VIOLATION (0xc0000005) at pc = 0x7c9310d4, pid = 2604, tid = 3664 # # JRE version: 6.0_24-b07 # Java VM: Java HotSpot (TM) Client VM (19.1-b02 mixed mode, sharing wi

FATAL ERROR: Could not find mysqld

Installation or when re-mysql-5.1.30 mysql_install_db appears FATAL ERROR: Could not find mysqld error solution As / etc / mysql / my.cnf under the emergence of a Solution: mv / etc / mysql / my.cnf / etc / mysql / my.cnf.bak cp support-files/my-medi ...

Fatal error: Call to undefined function: mysql_connect () solution

http://www.9enjoy.com/post/188/ The machine Windows2000 downloading good apache2 + php5 + mysql, run the program, tips Quote Fatal error: Call to undefined function: mysql_connect (). php.ini has extension = php_mysql.dll in the front; removed, but c

XDMCP fatal error: Session declined Maximum number of open sessions from ...

Recently way out XDMCP remote login ubuntu, and often out of the question: XDMCP fatal error: Session declined Maximum number of open sessions from your host .. who can not log on, the tireless efforts of the last in X-win32 the official website to f

Start tomcat exception error "Parse Fatal Error" and "org.xml.sax.SAXParseException" solution

tomcat startup exception, reported the error: Parse Fatal Error at line 1 column 31: bad continuation of multi-byte UTF-8 sequence (character code: 0xffffffd4) org.xml.sax.SAXParseException: bad continuation of multi-byte UTF-8 sequence (character code: 0

Fatal error: Cannot redeclare class

Fatal error: Cannot redeclare class XXX Can not re-declare class XXX, Generally appear in two classes when you have the same name, The problem is usually caused by file contains, for example should use include_once to include files, and not only incl

fatal error C1083: Cannot open source file

In VS2008 VC + + project, created a new cpp file and then manually delete the physical hard disk, and to the following error. 1 >------ Build started: Project: test, Configuration: Debug Win32 ------ 1> Compiling ... 1> random.cpp 1> c1xx

FATAL ERROR: Could not find mysqld processing

Error message: #./bin/mysql_install_db –user=mysql FATAL ERROR: Could not find mysqld The following directories were searched: /usr/libexec /usr/sbin /usr/bin If you compiled from source, you need to run ‘make install’to copy the software into the co

Fatal error: Maximum execution time of 30 seconds exceeded in error solution

zz from: http://hi.baidu.com/fei441544558/blog/item/e975bbfa6c36e3839f51461c.html - Method one ---------------------------------------------- -------------- Fatal error: Maximum execution time of 30 seconds exceeded in Sometimes run a large site or o

mongoclient.lib (dbclient.obj): fatal error LNK1112: module machine type 'x64'

Error: mongoclient.lib (dbclient.obj): fatal error LNK1112: module machine type 'x64' conflicts with target machine type 'X86' Provided that: the use scons to compile from source mongodb mongoclient.lib, version v2.0.0 Compiled by sco

IT project management in the six fatal error

Error 1: Error demand research phase, resulting in many projects never end! In the software industry, there is no formal show in interface design to the customer before work is in demand all the research stage. In fact, the construction industry a precede

Fatal Error C1010: unexpected end of file while looking for precompiled header

Error Message unexpected end of file while looking for precompiled header. Did you forget to add '# include name' to your source? http://msdn.microsoft.com/en-us/library/d7fz9ckx (VS.80). aspx writes Error Message unexpected end of file while

IT project management of the six fatal error

Error one: the demand for research phase error, resulting in many projects never end! In the software industry, there is no formal show in the interface design to the customer before work is in demand all the research phase. In fact, the construction indu

Resolving a Fatal error: Call to undefined function mysql_connect ()

Php do a lot of things, and has been integrated with the apache and php server whim today, it should be said yesterday, and to determine their own look from scratch with php environment a lot of online articles related to configuration, casually foun ...

Solution PHP Fatal error: Call to undefined function json_encode ()

Need to install json extension. First install gcc and php_pear, if yum so. Then install the extension, this time it will be compiled: pecl install json Build configuration: echo "extension = json.so"> / etc / php.d / json.ini Restart apa ...

Fatal error: Call to undefined function mysql_connect ()

Is not configured PHP5, PHP5 no longer the default support MYSQL. You need to modify the PHP.INI, the EXTENSION of the DLL file on MYSQL before; removed, while the PHP5 install a package called libmysql.dll the DLL file to C: \ windows or C: \ window

window under the Fatal error: Call to undefined function curl_init () solution!

php_curl.dll copied to the php install directory under the ext directory and open the php.ini to find; extension = php_curl.dll to; removed if the following issues C: \ Documents and Settings \ Administrator> php PHP Warning: PHP Startup: Unable to loa

fatal error LNK1120: 1 unresolved external command

Function is not achieved, only the definition of inherited or something not achieved Looks like is the lack of the corresponding lib file will cause this result and the lib file to be included in the project directory is on the project seems to be im

Libjingle another very hidden but very fatal error - WSAECONNRESET (10054) Connection reset by peer.

Whether Libjingle 0.4.0 or 0.5.2 (a great change compared to 0.4.0), there is a hidden very deadly bug that could cause voice call can only be heard when the party's voice. fix method: physicalsocketserver.cc 1. # Ifdef WIN32 # Define WIN32_LEAN_

IE: iexplore.exe Application Error The memory could not be "read" solution

In the [Run], enter cmd enter, then at the command prompt type: for %1 in (%windir%\system32\*.dll) do regsvr32.exe /s %1 Tip: If you fear a mistake, you can copy these instructions, then click the box in the upper left corner of the command prompt C

Big picture thumbnails lead to memory corruption issue imagecreatefromjpeg

When the picture more than 1M following error may occur when of course it also tell you about if you set the php.ini in the php memory_limit 16M set too small, then this will appear the following error! Fatal error: Allowed memory size of 8388608 byt

Magento Installation Tutorial

Magento is a new, professional, open-source e-commerce solution that offers unprecedented flexibility and controllability. With Magento, your e-commerce business, time will not feel very difficult. Because it is open source, so are free to download M ...

PHP 5.3 New Features Summary

I. Introduction As early as the release of PHP5 object-oriented programming (OOP) and design made great progress, it offers many new features, such as the visibility of the class, class reflections. Can say for the PHP Object Oriented Programming has made

The default php.ini file hosting

bluehost, cPanel can generate a default in the configuration file php.ini, if you need some Teshu the settings, you can download this file, edit the file in the local to the directory and can upload, Suozuo the editor immediately effective. Method of

mysql error code (Memo)

mysql error code (Memo) Transfer 1005: create table failed 1006: Create Database Failed 1007: The database already exists, create a database failure 1008: The database does not exist, delete the database failed 1009: Can not delete the database file to de

Oracle Error Code List

Oracle error code list, to facilitate all inquiries! (More words, can not release all of the rest in one floor, the sofa) ORA-00001: unique constraint violation (.) ORA-00017: session requested to set trace event ORA-00018: exceeded maximum number of sess

ORACLE error message

00000,0, " Normal, complete success " 00001,0, " There are duplicate key index " 00017,0, " Request for a dialogue to set up accident " 00018,0, " Exceed the maximum number of sessions " 00019,0, " Exceed the maximum permitted number of dialogue " 00020,0

Oracle Error List (1)

ORA-00001: unique constraint violation (.) ORA-00017: session request to set the track events ORA-00018: exceeded maximum number of sessions ORA-00019: exceeded maximum number of session licenses ORA-00020: exceeded maximum number of processes () ORA-0002

Oracle Error List (2)

ORA-02201: sequence not allowed here (No.) ORA-02202: this cluster does not allow to add other table ORA-02203: INITIAL storage options not allowed ORA-02204: not allowed ALTER, INDEX and EXECUTE for the view ORA-02205: only SELECT and ALTER privileges on

SOCKET socket error code description

Reprinted from: http://hi.baidu.com/c95wl/blog/item/1b8e75220e31b2a34723e87f.html (Encountered an error code of ... depressed ... NND ...) This article describes possible error codes, by WSAGetLastError (Wsapiref_2tiq.asp) function returns. Alphabetical l

Oracle error code meaning

ORA-02001: user SYS is available does not allow to create a list of group index ORA-02002: write error when the trial record leads ORA-02003: invalid USERENV parameter ORA-02004: security breach ORA-02005: implicit (-1) length of the data type definition

Reprinted: mysql error code

Transfer from: http://5211422.javaeye.com/blog/548157 1. Server error codes and messages Server error information from the following source file: * Error message information is listed in share / errmsg.txt file. "% D" and "% s" represe

[Reprinted] Error List

ORA-00001: unique constraint violation (.) ORA-00017: session requested to set trace event ORA-00018: exceeded maximum number of sessions ORA-00019: exceeded maximum number of session licenses ORA-00020: exceeded maximum number of processes () ORA-00021:

ORACLE error list (part)

ORA-02001: user SYS is not allowed to create a list of group index available orA-02002: Error writing audit trail in mind orA-02003: invalid USERENV parameter orA-02004: security breach orA-02005: implicit (-1) length of the data type definition and assig

Oracle Error Codes - List - 1

ORA-00001: unique constraint violation (.) ORA-00017: session requested to set trace event ORA-00018: exceeded maximum number of sessions ORA-00019: exceeded maximum number of session licenses ORA-00020: exceeded maximum number of processes () ORA-00021:

Oracle Error Code List - 2

ORA-01883: disable conversion process in the region of overlap ORA-01890: NLS error detected ORA-01891: datetime / interval internal error ORA-01898: too many precision specifiers ORA-01899: wrong precision specifier ORA-01900: LOGFILE keyword required OR

ORACLE error list, we facilitate query! (Reprint)

ORACLE error list, we facilitate query! ORA-00001: unique constraint violation (.) ORA-00017: session requested to set trace event ORA-00018: exceeded maximum number of sessions ORA-00019: exceeded maximum number of session licenses ORA-00020: exceeded ma

Dell Server Error Codes

E1000 Failsafe voltage error. Contact support. (Fault protection voltage error, please contact the support staff.) View the system event log for critical failure events. Disconnect the AC power for 10 seconds, then restart the system. E1114 Ambient T

mysql table more complete error code (1)

0101 belongs to other process-specific signs. 0102 flag has been set, can not be closed. 0103 can not set the flag again. 0104 can not request dedicated interrupt flags. 0105 the previous ownership of this mark has been terminated. 0106 Put a floppy disk

I used Linux command of perror - Explain Error Codes

I used Linux command of perror - Explain Error Codes This link: http://codingstandards.iteye.com/blog/1127327 (reproduced please indicate the source) Use Description perror command is a MySQL database system utility, which is used to print the C language

Reproduced: mysql error code

Transfer: http://5211422.iteye.com/blog/548157 1 server error codes and messages Server error information comes from the following source file: • Error message information is listed in share / errmsg.txt file. "% D" and "% s" represent

[Reserved] Error List

ORA-00001: unique constraint violation conditions (.) ORA-00017: session requested to set trace event ORA-00018: exceeded maximum number of sessions ORA-00019: exceeded maximum number of session licenses ORA-00020: exceeded maximum number of processes ()

Oracle error code - List - 1

ORA-00001: unique constraint violation conditions (.) ORA-00017: session requested to set trace event ORA-00018: exceeded maximum number of sessions ORA-00019: exceeded maximum number of session licenses ORA-00020: exceeded maximum number of processes ()

oracle error code Daquan 1

Oracle error code list Oracle error code list for everyone to check! (More words, not all of the release, the rest in 1 sofa) ORA-00001: unique constraint violation conditions (.) ORA-00017: session requested to set trace event ORA-00018: exceeded maximum

oracle error code Daquan 2

ORA-01200: actual file size is less than the correct size of the block ORA-01201: file header can not be written correctly ORA-01202: wrong prototype for this file - wrong creation time ORA-01203: wrong prototype for this file - wrong creation SCN ORA-012
Recent
Recent Entries
Tag Cloud
Random Entries