poweredge r410 onboard regulator failed e122e

sponsored links

Chemicals regulator failed: WWF

p> Australia pesticide regulator is broken and any extension of powers would be dangerous, says the conservation group WWF. / p> He said endosulfan has been used very little in Australia and "very tightly controlled, and new monitoring sys

Dell Server Error Codes

E1000 Failsafe voltage error. Contact support. (Fault protection voltage error, please contact the support staff.) View the system event log for critical failure events. Disconnect the AC power for 10 seconds, then restart the system. E1114 Ambient T

Linux network card detection and setting

This is my depressing thing at least a week, write to you, as you accumulate experience points, anyway, I was in the boss down the technology No bad habits (PS: To be honest, I am also doing development, the results let me engage in deployment). Firs ...

Medium DWR failed to read input

DWR project used asynchronous, sometimes there will be failed to read input prompt box, my sun. Online to find a solution, as follows: At DWR's engine.js inside the code is as follows: dwr.engine.defaultErrorHandler = function (message, ex) ( dwr ...

After the report was revised context root Failed to load webapp: Context root / * is already bound. Error

Today, what was modified in the application context root, changed the root path "/" to start the Times Failed to load webapp: Context root / * is already bound. Error. Then look for a moment, the installation was originally installed by default

Serious: Error listenerStart serious: Context [] startup failed due to previous errors

Release time to deploy a java and flex project integrated a moment when an exception: 2010-1-20 16:52:26 org.apache.catalina.core.AprLifecycleListener init Information: The APR based Apache Tomcat Native library which allows optimal performance in product

Failed to parse multipart request

> ----- Original Message ----- > From: Sharma, Kamlesh [RA] [mailto: KAMLESH.SHARMA @ saic.com] > Sent: Wednesday, April 28, 2004 1:37 PM > To: commons-user@jakarta.apache.org > Subject: Re: File upload exception " " > Hi, All

hibernate user 'xxxx' Login failed. the user to connect with trusted SQL SERVER unrelated

Doing hibernate connection data sqlserver 2005, when a mistake. The first is the pop-up Exception in thread "main" org.hibernate.exception.SQLGrammarException: Cannot open connection Caused by: com.microsoft.sqlserver.jdbc.SQLServerExceptio ...

Install tomcat there failed to install tomcat6 service errors and solutions (reproduced)

Recently, when installing tomcat, always give me newspaper failed to install tomcat6 service, check your setting and permissio error, let me depressed a little time. Finally found that I had originally installed tomcat, but delete it, simply delete i ...

WARNING: Parameters: Character decoding failed. Parameter skipped

org.apache.tomcat.util.http.Parameters processParameters WARNING: Parameters: Character decoding failed. Parameter skipped. java.io.CharConversionException: EOF at org.apache.tomcat.util.buf.UDecoder.convert (UDecoder.java: 83) at org.apache.tomcat.u ...

SLF4J: Failed to load class "org.slf4j.impl.StaticLoggerBinder" problem-solving (transfer)

SLF4J: Failed to load class "org.slf4j.impl.StaticLoggerBinder". SLF4J: See http://www.slf4j.org/codes.html # StaticLoggerBinder for further details. Exception in thread "main" java.lang.NoClassDefFoundError: org/slf4j/impl/Static ...

java.net.SocketException: Software caused connection abort: recv failed

Record a socket programming exception: java.net.SocketException: Software caused connection abort: recv failed Conclusion on the causes: Should the client or the server side has been closed at one end, while the other end that the connection is still ...

com.microsoft.sqlserver.jdbc.SQLServerException: to the host's TCP / IP connection failed. java.net.Co

Written test when doing hibernat class when an error occurs. com.microsoft.sqlserver.jdbc.SQLServerException: to the host's TCP / IP connection failed. java.net.ConnectException: Connection refused: connect After much search discovered the problem whe

About MongoDB in the 64-bit server is still reported mmap failed with out of memory error solution (with Mysql performance comparison test)

In the 32-bit platforms, MongoDB and prone to "mmap failed with out of memory" error, because 32-bit platform MongoDB database files are not allowed (cumulative total) of more than 2G, and 64-bit platforms do not have this restriction. Want ...

VS2005: Can not start debugging on the web server. Debugging failed because integrated windows authentication not enabled

VS2005: Can not start debugging on the web server. Debugging failed because integrated windows authentication not enabled C #, ASP.NET Web application, compile-time error: Unable to start debugging on the web server. Debugging failed because integrat ...

winnt_accept: Asynchronous AcceptEx failed problem

http://blog.chinaunix.net/u/4257/showart_1000959.html These days many people have encountered a problem encountered this problem in google there are too many people have experienced, but few have pointed out that the final solution, most of them sett ...

Failed to access IIS metabase problem

Error: Failed to access IIS metabase. Description: During the execution of the current Web request, an unhandled exception. Please review the stack trace information, to learn more about the error and lead to errors in the source code details. Exception D

Netbeans using S60 3rd Edition FP1 failed to initialize session error

Recently tossing Nokia SDK ... Eclipse always get it working, I do not know if it is win7 permission issues ... so he Netbeans ... When running Nokia simulator also was wrong ... Error message is: failed to initialize session Check the website under ...

FLEX RPC FAILED CODE: Error # 2048

If you also encounter the following problems, I might try the next solution: Issue 1, Flex unresponsive program, debug the result is time-consuming call back service in remoteObject; Issue 2, Flex project (released only native access) in the native p ...

Dell poweredge 2950 System Installation Notes

Danian had happily finished, start the new year's work, but everything seems to be on the old saying goes, everything is hard in the beginning, a development with vs2003 and vs2005 program is not compatible with the two versions of the problem ha ...

VC2005-"the application failed to initialize properly"-0xc0150002 (Reprinted)

Confused the issue in recent days has been a long time. Sigh Microsoft's stuff is really bigger and bad, and finally understood after a lapse of 12 years because we still hang on VC6. . Compiled with VC2005 program, compiled without any error, bu ...

Failed to read auto-increment value from storage engine

The project has encountered a problem, that is, data stored on a table when an error, "Failed to read auto-increment value from storage engine". In the structure of the table after a careful examination of the table auto_increment values ar ...

smbclient connection error: tree connect failed: NT_STATUS_BAD_NETWORK_NAME

Connect using smbclient from the RedHat 5 Win2K3 error: Search for a long time ~ ~ depressed for a long time before the results showed that out of my Win2K3 announced the root name is E $, can not specify the lower-level directory. This right has wit ...

XP under Virtualbox Virtual Ubuntu shared folder set (mounting failed with the error: Protocol error)

Environment: the host operating system is Windows XP , the virtual machine is Ubuntu 9.10, the virtual machine is VirtualBox 3.08. 1. Installing Enhanced Feature Pack (Guest Additions) Installed Ubuntu 9.10, run Ubuntu and login. VirtualBox's menu and

FAL [client]: Failed to request gap sequence of the resolved

Log appears the following error message Fri Apr 2 21:37:45 2010 FAL [client]: Failed to request gap sequence GAP - thread 1 sequence 168065-168164 DBID 3642507004 branch 645772988 FAL [client]: All defined FAL servers have been attempted. ----------------

On the "HTTP/1.1 New session failed" solution to the problem

Phenomenon: access when "HTTP/1.1 New Session Failed", asp page can not normally access Solution: (1) restart IIS services; (2) end of the w3wp.exe process; (3) Open the Internet Information Services (IIS) Manager, expand Application Pools, the

RA layer request failed svn: Commit failed (details follow): svn: Commit failed

RA layer request failed svn: Commit failed (details follow): svn: CHECKOUT of '/ svn/CM4 /! svn/ver/17904/tags/cnweb_cm4.3_20100208/build.xml': 403 Forbidden (https: / / 211.88.26.244:8443) Today, faced such a problem a few svn update can not ...

spring configuration file failed to load

In the sping the most at the beginning of the configuration file must not have spaces, otherwise it will load the configuration file failed.

Solution apache's the requested operation has failed

Installed after a latest version of svn. apache not start. Prompted the requested operation has failed. Spent half a day of little prospect of a solution of. Run - "cmd into apache's bin directory. Enter httpd.exe-w-n "Apache"-k st ...

Failed to access IIS Metabase question

Error: Failed to access IIS metabase. Description: During the execution of the current Web request, an unhandled exception. Please review the stack trace information, to learn more about the error and lead to errors in the source code details. Exception D

Android2.1 sdk update failed to install solution

Used for a long time of 1.6 and 2.0 versions, and is finally ready to update about it! . Also encountered the message as "Failed to fetch URL ..." error prompt. Solution: I thought this way can update completed and the results, there is a m ...

To execute child process "testparm" failed (not the file or directory)

To execute child process "testparm" failed (not the file or directory) To execute child process "testparm" failed (not the file or directory): sudo apt-get install samba-common-bin Done!

4.1spring mvc appears "Failed to convert property value of type" solution

This problem into two categories String converted to basic types (int, long, boolean, char ...) With such high-level controller can add a static method @InitBinder protected void init(HttpServletRequest request, ServletRequestDataBinder binder) throws Web

Failed to load class "org.slf4j.impl.StaticLoggerBinder". Problem-solving

After conducting hibernate configured when you run the test class: Solution: Download: http://www.slf4j.org/dist/slf4j-1.5.2.zip After extracting the slf4j-nop-1.5.2.jar added to the project class library. Uploaded file attachments in

windows xp install postgresql8.4 error The database cluster initialization failed

In the xp install postgresql8.4 for the first time the choices are local, the installation error is a conf file error, then that "The database cluster initialization failed" the error. Later, a search for a long time in google say should se ...

Check the output parameters (register output parameters failed) IN Ibatis

Use IBatis calling Oracle stored procedure or function, the following exception as follows: -------------------------------------------------- --------------------------------------------- org.springframework.jdbc.UncategorizedSQLException: SqlMapCli ...

SQL Server "sa" login failed + to restore the backup database memory limit

[/ Color] [color = red] hey now replaced with sql server database, then when I really met a lot of questions to share with you the next show Error message is as follows: User 'sa' Login failed. The user with trusted SQL Server connection is n ...

Rails Session Save failed

The same set of code, deployed in the same server, but it is strange that a work, and always appear when a log ActionController:: InvalidAuthenticityToken exception, even with the skip_before_filter: verify_authenticity_token, although not unusual, b ...

"Alps dell touchpad installation failed" solution

Machine: dell D630 OS: xp sp2 pro Symptoms: Touchpad normal, DellTPad double-no response, can not be set "to use USB mouse, disabling the touchpad, track stick," to re-install the alps dell touchpad driver, prompted to install failed; Solut ...

RA layer request failed

Day, simultaneous with the eclipse can not access the SVN server hearted: org.tigris.subversion.javahl.ClientException: RA layer request failed svn: Server sent unexpected return value (403 Forbidden) in response to OPTIONS request for 'https: / ...

asp.net encountered ERROR: System.Web.Hosting.HostingEnvironmentException: Failed to access IIS metabase

Today someone else's do some asp.net Create a new Web site and then write something, then a run on experience asp.net encountered ERROR: System.Web.Hosting.HostingEnvironmentException: Failed to access IIS metabase. Error friend is to first insta ...

Resolve Error "The underlying connection was closed: failed to SSL / TLS secure channel to establish a trust relationship."

Today, when the call to write the program to a third party DLL files, the native debugging everything normal, but the process is not to the server has been prompted after a BUG: "The underlying connection was closed: failed to SSL / TLS secure c ...

User 'sa' Login failed. Reason: not trusted SQL Server connection with the solution

A strange question, the project on the interaction with the database run locally not occur, when transplanted into the public network when a bunch of problems, this does not like to use the MS database, but found a problem under solution. LOOK " Unab

. / Mysqladmin: connect to server at 'localhost' failed. Error: 'Access denied ...

Scenarios: After installing mysql, mysql started to set the root user's password, the resulting error message: #. / Mysqladmin-uroot-p password "123456" Enter password: . / Mysqladmin: connect to server at 'localhost' failed err

rpm mandatory install, error: Failed dependencies:

Install rpm packages in linux often encounter the following problem: error: Failed dependencies: xxxxxxxxxxxxxxxxxxxxxx Encounter this problem you can install the rpm package added after the order of two parameters, such as: rpm-ivh jdk-1_5_0_07-linu

Solve dwr framework failed to read input problems

Use dwr project, met failded to read input problem, google, I learned some changes are proposals engine.js cure, after modification or will appear. Download the dwr source, found that burst failed to read input will be exceptions where there's no

conversion to dalvik format failed with error 1

conversion to dalvik format failed with error 1 solutions android low version works (such as 1.5) into the high version of the environment (such as 2.2) may be the wrong solution as follows: 1. If you do not modify the android sdk version, use the pr

SVN Commit failed (details follow): Can't open activity db: Permission denied.

TortoiseSVN Failed! SVN migration from server to another server (Linux), can checkout, but can not submit (commit). Failure to submit tips, as follows: "SVN Commit failed (details follow): Can't open activity db: Permission denied." The

Hibernate: org.hibernate.LazyInitializationException: failed to lazily initialize

Error Code: org.hibernate.LazyInitializationException: failed to lazily initialize a collection of role: *. Class.property, no session or session was closed Error reason: Mapping in hibernate because of delay in loading, before the operation so that

Failed to create the Java Virtual Machine

Version: eclipse-jee-helios-win32 Their computer to upload the jdk version: 1.6.0_20 Extract start, see a prompt box "Failed to create the Java Virtual Machine" Solution: Find the eclipse directory eclipse.ini, you can see the following: -S
Recent
Recent Entries
Tag Cloud
Random Entries